P2PEVOLVENET
type: Concept
type: Thing
type: NamedIndividual
type: Service
label: Opensource Evolv Enterprise Platform P2P Network Node Connection Protocol
notation: p2pevolvenet
term status: stable
date: 2018-01-16
description: Opensource Evolv Enterprise Platform P2P Network Node Connection Protocol
ports: 8004 (TCP)
in dataset: service

Adrians Borsteins
type: Agent

8004 (TCP)
type: Port
notation: 8004

TCP
type: Concept
type: Thing
type: NamedIndividual
type: Protocol
label: Transmission Control
notation: tcp
term status: stable
description: Transmission Control
IANA ref: RFC9293
in dataset: protocol
has part: 8004 (TCP)

RFC9293
type: Document

p2pevolvenet
type: Document
primary topic: P2PEVOLVENET