PIPE-SERVER
type: Concept
type: Thing
type: NamedIndividual
type: Service
label: IANA assigned this well-formed service name as a replacement for "pipe_server".
notation: pipe-server
term status: stable
description: IANA assigned this well-formed service name as a replacement for "pipe_server".
ports: 2010 (UDP)
in dataset: service

2010 (UDP)
type: Port
notation: 2010

UDP
type: Concept
type: Thing
type: NamedIndividual
type: Protocol
label: User Datagram
notation: udp
term status: stable
description: User Datagram
IANA ref: RFC768
in dataset: protocol
has part: 2010 (UDP)

RFC768
type: Document

Jon Postel
type: Agent

pipe-server
type: Document
primary topic: PIPE-SERVER