PKIXREP
type: Concept
type: Thing
type: NamedIndividual
type: Service
label: Public Key Infrastructure Repository Locator Service
notation: pkixrep
term status: stable
description: Public Key Infrastructure Repository Locator Service
IANA ref: RFC4386
in dataset: service

RFC4386
type: Document

pkixrep
type: Document
primary topic: PKIXREP