RADG
type: Concept
type: Thing
type: NamedIndividual
type: Service
label: GSS-API for the Oracle Remote Administration Daemon
notation: radg
term status: stable
date: 2002-08
modified: 2016-09-15
description: GSS-API for the Oracle Remote Administration Daemon
ports: 6789 (TCP)
in dataset: service

Shawn Emery
type: Agent

6789 (TCP)
type: Port
notation: 6789

TCP
type: Concept
type: Thing
type: NamedIndividual
type: Protocol
label: Transmission Control
notation: tcp
term status: stable
description: Transmission Control
IANA ref: RFC9293
in dataset: protocol
has part: 6789 (TCP)

RFC9293
type: Document

radg
type: Document
primary topic: RADG