SIA-CTRL-PLANE
type: Concept
type: Thing
type: NamedIndividual
type: Service
label: Service Insertion Architecture (SIA) Control-Plane
notation: sia-ctrl-plane
term status: stable
date: 2009-10-29
description: Service Insertion Architecture (SIA) Control-Plane
ports: 4787 (TCP)
in dataset: service

Shree Murthy
type: Agent

4787 (TCP)
type: Port
notation: 4787

TCP
type: Concept
type: Thing
type: NamedIndividual
type: Protocol
label: Transmission Control
notation: tcp
term status: stable
description: Transmission Control
IANA ref: RFC9293
in dataset: protocol
has part: 4787 (TCP)

RFC9293
type: Document

sia-ctrl-plane
type: Document
primary topic: SIA-CTRL-PLANE