XCAP-PORTAL
type: Concept
type: Thing
type: NamedIndividual
type: Service
label: xcap code analysis portal public user access
notation: xcap-portal
term status: stable
date: 2018-06-06
description: xcap code analysis portal public user access
ports: 4888 (TCP)
in dataset: service

Manfred Koethe
type: Agent

4888 (TCP)
type: Port
notation: 4888

TCP
type: Concept
type: Thing
type: NamedIndividual
type: Protocol
label: Transmission Control
notation: tcp
term status: stable
description: Transmission Control
IANA ref: RFC9293
in dataset: protocol
has part: 4888 (TCP)

RFC9293
type: Document

xcap-portal
type: Document
primary topic: XCAP-PORTAL