ADAPTIVE-RN
type: Concept
type: Thing
type: NamedIndividual
type: Service
label: ARN (Adaptive Routing Notification) is a protocol designed to enable dynamic routing adjustments by sharing network status information between nodes in data center networks, improving efficiency and fault tolerance.
notation: adaptive-rn
term status: stable
date: 2024-11-22
description: ARN (Adaptive Routing Notification) is a protocol designed to enable dynamic routing adjustments by sharing network status information between nodes in data center networks, improving efficiency and fault tolerance.
in dataset: service

Hongyi Huang
type: Agent

UDP
type: Concept
type: Thing
type: NamedIndividual
type: Protocol
label: User Datagram
notation: udp
term status: stable
description: User Datagram
IANA ref: RFC768
in dataset: protocol
has part: ADAPTIVE-RN

RFC768
type: Document

Jon Postel
type: Agent

TCP
type: Concept
type: Thing
type: NamedIndividual
type: Protocol
label: Transmission Control
notation: tcp
term status: stable
description: Transmission Control
IANA ref: RFC9293
in dataset: protocol
has part: ADAPTIVE-RN

RFC9293
type: Document

adaptive-rn
type: Document
primary topic: ADAPTIVE-RN