AMPL-TABLEPROXY
type: Concept
type: Thing
type: NamedIndividual
type: Service
label: The protocol is used by two programs that exchange "table" data used in the AMPL modeling language
notation: ampl-tableproxy
term status: stable
date: 2012-05-25
description: The protocol is used by two programs that exchange "table" data used in the AMPL modeling language
ports: 5196 (TCP)
in dataset: service

David M. Gay
type: Agent

5196 (TCP)
type: Port
notation: 5196

TCP
type: Concept
type: Thing
type: NamedIndividual
type: Protocol
label: Transmission Control
notation: tcp
term status: stable
description: Transmission Control
IANA ref: RFC9293
in dataset: protocol
has part: 5196 (TCP)

RFC9293
type: Document

ampl-tableproxy
type: Document
primary topic: AMPL-TABLEPROXY