APPLERDBG
type: Concept
type: Thing
type: NamedIndividual
type: Service
label: Apple Remote Debug Services (OpenGL Profiler)
notation: applerdbg
term status: stable
description: Apple Remote Debug Services (OpenGL Profiler)
in dataset: service

Dave Springer
type: Agent

applerdbg
type: Document
primary topic: APPLERDBG