ARCNET
type: Concept
type: Thing
type: NamedIndividual
type: Service
label: Arcturus Networks Inc. Hardware Services
notation: arcnet
term status: stable
date: 2011-10-20
description: Arcturus Networks Inc. Hardware Services
in dataset: service

Michael Durrant
type: Agent

UDP
type: Concept
type: Thing
type: NamedIndividual
type: Protocol
label: User Datagram
notation: udp
term status: stable
description: User Datagram
IANA ref: RFC768
in dataset: protocol
has part: ARCNET

RFC768
type: Document

Jon Postel
type: Agent

arcnet
type: Document
primary topic: ARCNET