ARN
type: Concept
type: Thing
type: NamedIndividual
type: Service
label: Active Registry Network for distribution of values and streams
notation: arn
term status: stable
date: 2013-10-17
description: Active Registry Network for distribution of values and streams
in dataset: service

Michael Wiklund
type: Agent

TCP
type: Concept
type: Thing
type: NamedIndividual
type: Protocol
label: Transmission Control
notation: tcp
term status: stable
description: Transmission Control
IANA ref: RFC9293
in dataset: protocol
has part: ARN

RFC9293
type: Document

arn
type: Document
primary topic: ARN