ASMPS
type: Concept
type: Thing
type: NamedIndividual
type: Service
label: Nuance AutoStore Status Monitoring Protocol (secure data transfer)
notation: asmps
term status: stable
date: 2011-09-01
modified: 2017-04-26
description: Nuance AutoStore Status Monitoring Protocol (secure data transfer)
ports: 45001 (TCP)
in dataset: service

Andrew Andrews
type: Agent

45001 (TCP)
type: Port
notation: 45001

TCP
type: Concept
type: Thing
type: NamedIndividual
type: Protocol
label: Transmission Control
notation: tcp
term status: stable
description: Transmission Control
IANA ref: RFC9293
in dataset: protocol
has part: 45001 (TCP)

RFC9293
type: Document

asmps
type: Document
primary topic: ASMPS