BEATPACK
type: Concept
type: Thing
type: NamedIndividual
type: Service
label: BeatPack Synchronization Server for BeatMaker
notation: beatpack
term status: stable
description: BeatPack Synchronization Server for BeatMaker
in dataset: service

Mathieu Garcia
type: Agent

beatpack
type: Document
primary topic: BEATPACK