BRSKI-PLEDGE
type: Concept
type: Thing
type: NamedIndividual
type: Service
label: The Bootstrapping Remote Secure Key Infrastructure Pledge
notation: brski-pledge
term status: stable
date: 2026-05-11
description: The Bootstrapping Remote Secure Key Infrastructure Pledge
in dataset: service

IETF Chair
type: Agent

TCP
type: Concept
type: Thing
type: NamedIndividual
type: Protocol
label: Transmission Control
notation: tcp
term status: stable
description: Transmission Control
IANA ref: RFC9293
in dataset: protocol
has part: BRSKI-PLEDGE

RFC9293
type: Document

brski-pledge
type: Document
primary topic: BRSKI-PLEDGE