CADSISVR
type: Concept
type: Thing
type: NamedIndividual
type: Service
label: This server provides callable services to mainframe External Security Managers from any TCP/IP platform
notation: cadsisvr
term status: stable
date: 2015-06-02
modified: 2023-03-29
description: This server provides callable services to mainframe External Security Managers from any TCP/IP platform
ports: 16789 (TCP)
in dataset: service

Thomas Sakowski
type: Agent

16789 (TCP)
type: Port
notation: 16789

TCP
type: Concept
type: Thing
type: NamedIndividual
type: Protocol
label: Transmission Control
notation: tcp
term status: stable
description: Transmission Control
IANA ref: RFC9293
in dataset: protocol
has part: 16789 (TCP)

RFC9293
type: Document

cadsisvr
type: Document
primary topic: CADSISVR