CPDLC
type: Concept
type: Thing
type: NamedIndividual
type: Service
label: Controller Pilot Data Link Communication
notation: cpdlc
term status: stable
date: 2011-05-18
description: Controller Pilot Data Link Communication
ports: 5911 (SCTP)
in dataset: service

Justin Yu
type: Agent

5911 (SCTP)
type: Port
notation: 5911

SCTP
type: Concept
type: Thing
type: NamedIndividual
type: Protocol
label: Stream Control Transmission Protocol
notation: sctp
term status: stable
date: 2000-04
description: Stream Control Transmission Protocol
in dataset: protocol
has part: 5911 (SCTP)

Randall R. Stewart
type: Agent

cpdlc
type: Document
primary topic: CPDLC