DATATURBINE
type: Concept
type: Thing
type: NamedIndividual
type: Service
label: Open Source DataTurbine Streaming Data Middleware
notation: dataturbine
term status: stable
description: Open Source DataTurbine Streaming Data Middleware
in dataset: service

Tony Fountain
type: Agent

dataturbine
type: Document
primary topic: DATATURBINE