DEPLOYMENTMAP
type: Concept
type: Thing
type: NamedIndividual
type: Service
label: Service to distribute and update within a site deployment information for Oracle Communications Suite
notation: deploymentmap
term status: stable
date: 2013-09-20
description: Service to distribute and update within a site deployment information for Oracle Communications Suite
ports: 4570 (TCP)
in dataset: service

Dan Newman
type: Agent

4570 (TCP)
type: Port
notation: 4570

TCP
type: Concept
type: Thing
type: NamedIndividual
type: Protocol
label: Transmission Control
notation: tcp
term status: stable
description: Transmission Control
IANA ref: RFC9293
in dataset: protocol
has part: 4570 (TCP)

RFC9293
type: Document

deploymentmap
type: Document
primary topic: DEPLOYMENTMAP