DICTATION
type: Concept
type: Thing
type: NamedIndividual
type: Service
label: Use of a dictation service by a hand-held device
notation: dictation
term status: stable
date: 2011-10-27
description: Use of a dictation service by a hand-held device
in dataset: service

Mark Jackson
type: Agent

dictation
type: Document
primary topic: DICTATION