DUCKRACE
type: Concept
type: Thing
type: NamedIndividual
type: Service
label: A communication protocol that allows a school teacher to set work activities to students over a LAN.
notation: duckrace
term status: stable
date: 2013-10-03
description: A communication protocol that allows a school teacher to set work activities to students over a LAN.
in dataset: service

Gary Atkinson
type: Agent

TCP
type: Concept
type: Thing
type: NamedIndividual
type: Protocol
label: Transmission Control
notation: tcp
term status: stable
description: Transmission Control
IANA ref: RFC9293
in dataset: protocol
has part: DUCKRACE

RFC9293
type: Document

duckrace
type: Document
primary topic: DUCKRACE