EASYENGINE
type: Concept
type: Thing
type: NamedIndividual
type: Service
label: EasyEngine is CLI tool to manage WordPress Sites on Nginx server
notation: easyengine
term status: stable
date: 2014-03-10
description: EasyEngine is CLI tool to manage WordPress Sites on Nginx server
ports: 22222 (TCP)
in dataset: service

Rahul Bansal
type: Agent

22222 (TCP)
type: Port
notation: 22222

TCP
type: Concept
type: Thing
type: NamedIndividual
type: Protocol
label: Transmission Control
notation: tcp
term status: stable
description: Transmission Control
IANA ref: RFC9293
in dataset: protocol
has part: 22222 (TCP)

RFC9293
type: Document

easyengine
type: Document
primary topic: EASYENGINE