ECMS
type: Concept
type: Thing
type: NamedIndividual
type: Service
label: Northrup Grumman/Mission Systems/ESL Data Flow Protocol
notation: ecms
term status: stable
description: Northrup Grumman/Mission Systems/ESL Data Flow Protocol
in dataset: service

Dan Goff
type: Agent

ecms
type: Document
primary topic: ECMS