EDSSERVICE
type: Concept
type: Thing
type: NamedIndividual
type: Service
label: Provides resolution of EDS services available on a given network
notation: edsservice
term status: stable
date: 2016-07-19
description: Provides resolution of EDS services available on a given network
in dataset: service

Natarajan Subramanian
type: Agent

TCP
type: Concept
type: Thing
type: NamedIndividual
type: Protocol
label: Transmission Control
notation: tcp
term status: stable
description: Transmission Control
IANA ref: RFC9293
in dataset: protocol
has part: EDSSERVICE

RFC9293
type: Document

edsservice
type: Document
primary topic: EDSSERVICE