EFKON-ELITE
type: Concept
type: Thing
type: NamedIndividual
type: Service
label: EFKON Lightweight Interface to Traffic Events
notation: efkon-elite
term status: stable
date: 2011-10-20
description: EFKON Lightweight Interface to Traffic Events
in dataset: service

Thomas Kemmer
type: Agent

TCP
type: Concept
type: Thing
type: NamedIndividual
type: Protocol
label: Transmission Control
notation: tcp
term status: stable
description: Transmission Control
IANA ref: RFC9293
in dataset: protocol
has part: EFKON-ELITE

RFC9293
type: Document

efkon-elite
type: Document
primary topic: EFKON-ELITE