EWALLETSYNC
type: Concept
type: Thing
type: NamedIndividual
type: Service
label: Synchronization Protocol for Ilium Software's eWallet
notation: ewalletsync
term status: stable
description: Synchronization Protocol for Ilium Software's eWallet
in dataset: service

Dan Amstutz
type: Agent

ewalletsync
type: Document
primary topic: EWALLETSYNC