FIX
type: Concept
type: Thing
type: NamedIndividual
type: Service
label: Financial Information Exchange (FIX) Protocol
notation: fix
term status: stable
description: Financial Information Exchange (FIX) Protocol
in dataset: service

Joakim Johansson
type: Agent

fix
type: Document
primary topic: FIX