FMSERVER-ADMIN
type: Concept
type: Thing
type: NamedIndividual
type: Service
label: FileMaker Server Administration Communication Service
notation: fmserver-admin
term status: stable
description: FileMaker Server Administration Communication Service
in dataset: service

Eric Jacobson
type: Agent

fmserver-admin
type: Document
primary topic: FMSERVER-ADMIN