GUCAM-HTTP
type: Concept
type: Thing
type: NamedIndividual
type: Service
label: Image Data Transfer API for Wi-Fi Camera Devices over HTTP
notation: gucam-http
term status: stable
date: 2013-03-04
description: Image Data Transfer API for Wi-Fi Camera Devices over HTTP
in dataset: service

Hiroshi Matsuda
type: Agent

TCP
type: Concept
type: Thing
type: NamedIndividual
type: Protocol
label: Transmission Control
notation: tcp
term status: stable
description: Transmission Control
IANA ref: RFC9293
in dataset: protocol
has part: GUCAM-HTTP

RFC9293
type: Document

gucam-http
type: Document
primary topic: GUCAM-HTTP