IEC-104-SEC
type: Concept
type: Thing
type: NamedIndividual
type: Service
label: IEC 60870-5-104 process control - secure
notation: iec-104-sec
term status: stable
date: 2010-10-18
description: IEC 60870-5-104 process control - secure
ports: 19998 (TCP)
in dataset: service

Grant Gilchrist
type: Agent

19998 (TCP)
type: Port
notation: 19998

TCP
type: Concept
type: Thing
type: NamedIndividual
type: Protocol
label: Transmission Control
notation: tcp
term status: stable
description: Transmission Control
IANA ref: RFC9293
in dataset: protocol
has part: 19998 (TCP)

RFC9293
type: Document

iec-104-sec
type: Document
primary topic: IEC-104-SEC