IOT
type: Concept
type: Thing
type: NamedIndividual
type: Service
label: Internet-of-things (IoT) JSON telegram service
notation: iot
term status: stable
date: 2015-11-05
description: Internet-of-things (IoT) JSON telegram service
in dataset: service

SEVENSTAX GmbH
type: Agent

Ralf Schwarzer
type: Agent

TCP
type: Concept
type: Thing
type: NamedIndividual
type: Protocol
label: Transmission Control
notation: tcp
term status: stable
description: Transmission Control
IANA ref: RFC9293
in dataset: protocol
has part: IOT

RFC9293
type: Document

iot
type: Document
primary topic: IOT