IPOSPLANET
type: Concept
type: Thing
type: NamedIndividual
type: Service
label: IPOSPLANET retailing multi devices protocol
notation: iposplanet
term status: stable
date: 2012-10-23
description: IPOSPLANET retailing multi devices protocol
ports: 7031 (TCP)
in dataset: service

Fabrice Paget
type: Agent

7031 (TCP)
type: Port
notation: 7031

TCP
type: Concept
type: Thing
type: NamedIndividual
type: Protocol
label: Transmission Control
notation: tcp
term status: stable
description: Transmission Control
IANA ref: RFC9293
in dataset: protocol
has part: 7031 (TCP)

RFC9293
type: Document

iposplanet
type: Document
primary topic: IPOSPLANET