ISYNCHRONIZE
type: Concept
type: Thing
type: NamedIndividual
type: Service
label: iSynchronize data synchronization protocol
notation: isynchronize
term status: stable
date: 2011-10-11
description: iSynchronize data synchronization protocol
in dataset: service

Sergey Bolshedvorsky
type: Agent

TCP
type: Concept
type: Thing
type: NamedIndividual
type: Protocol
label: Transmission Control
notation: tcp
term status: stable
description: Transmission Control
IANA ref: RFC9293
in dataset: protocol
has part: ISYNCHRONIZE

RFC9293
type: Document

isynchronize
type: Document
primary topic: ISYNCHRONIZE