JEOL-NSDTP-1
type: Concept
type: Thing
type: NamedIndividual
type: Service
label: JEOL Network Services Data Transport Protocol 1
notation: jeol-nsdtp-1
term status: stable
date: 2008-04-17
description: JEOL Network Services Data Transport Protocol 1
ports: 6241 (TCP)
in dataset: service

Kevin Wellwood
type: Agent

6241 (TCP)
type: Port
notation: 6241

TCP
type: Concept
type: Thing
type: NamedIndividual
type: Protocol
label: Transmission Control
notation: tcp
term status: stable
description: Transmission Control
IANA ref: RFC9293
in dataset: protocol
has part: 6241 (TCP)

RFC9293
type: Document

jeol-nsdtp-1
type: Document
primary topic: JEOL-NSDTP-1