MAZEPSEUDO-GAME
type: Concept
type: Thing
type: NamedIndividual
type: Service
label: Peer to peer communication between instances of the Maze Pseudo game.
notation: mazepseudo-game
term status: stable
date: 2016-02-02
modified: 2016-03-30
description: Peer to peer communication between instances of the Maze Pseudo game.
in dataset: service

Kenneth Suda
type: Agent

UDP
type: Concept
type: Thing
type: NamedIndividual
type: Protocol
label: User Datagram
notation: udp
term status: stable
description: User Datagram
IANA ref: RFC768
in dataset: protocol
has part: MAZEPSEUDO-GAME

RFC768
type: Document

Jon Postel
type: Agent

mazepseudo-game
type: Document
primary topic: MAZEPSEUDO-GAME