NODEL
type: Concept
type: Thing
type: NamedIndividual
type: Service
label: Lightweight event based control protocol utilising JavaScript Object Notation
notation: nodel
term status: stable
date: 2013-02-07
description: Lightweight event based control protocol utilising JavaScript Object Notation
in dataset: service

Michael Cartmel
type: Agent

TCP
type: Concept
type: Thing
type: NamedIndividual
type: Protocol
label: Transmission Control
notation: tcp
term status: stable
description: Transmission Control
IANA ref: RFC9293
in dataset: protocol
has part: NODEL

RFC9293
type: Document

nodel
type: Document
primary topic: NODEL