OBJECTIVE
type: Concept
type: Thing
type: NamedIndividual
type: Service
label: Means for clients to locate servers in an Objective (http://www.objective.com) instance.
notation: objective
term status: stable
description: Means for clients to locate servers in an Objective (http://www.objective.com) instance.
in dataset: service

Marc Bailey
type: Agent

objective
type: Document
primary topic: OBJECTIVE