OLA
type: Concept
type: Thing
type: NamedIndividual
type: Service
label: Web Interface for the Open Lighting Architecture Software
notation: ola
term status: stable
date: 2013-12-09
modified: 2014-02-25
description: Web Interface for the Open Lighting Architecture Software
in dataset: service

Simon Newton
type: Agent

TCP
type: Concept
type: Thing
type: NamedIndividual
type: Protocol
label: Transmission Control
notation: tcp
term status: stable
description: Transmission Control
IANA ref: RFC9293
in dataset: protocol
has part: OLA

RFC9293
type: Document

ola
type: Document
primary topic: OLA