PIESYNC
type: Concept
type: Thing
type: NamedIndividual
type: Service
label: pieSync Computer to Computer Synchronization
notation: piesync
term status: stable
description: pieSync Computer to Computer Synchronization
in dataset: service

Timothy Wayper
type: Agent

piesync
type: Document
primary topic: PIESYNC