PRINT-CAPS
type: Concept
type: Thing
type: NamedIndividual
type: Service
label: Retrieve a description of a device's print capabilities
notation: print-caps
term status: stable
description: Retrieve a description of a device's print capabilities
in dataset: service

Troy Bergstrand
type: Agent

print-caps
type: Document
primary topic: PRINT-CAPS