PVACCESS
type: Concept
type: Thing
type: NamedIndividual
type: Service
label: Experimental Physics and Industrial Control System
notation: pvaccess
term status: stable
date: 2012-03-23
description: Experimental Physics and Industrial Control System
ports: 5075 (TCP)
in dataset: service

Matej Sekoranja
type: Agent

TCP
type: Concept
type: Thing
type: NamedIndividual
type: Protocol
label: Transmission Control
notation: tcp
term status: stable
description: Transmission Control
IANA ref: RFC9293
in dataset: protocol
has part: PVACCESS
has part: 5075 (TCP)

RFC9293
type: Document

5075 (TCP)
type: Port
notation: 5075

pvaccess
type: Document
primary topic: PVACCESS