RDMNET-CTRL
type: Concept
type: Thing
type: NamedIndividual
type: Service
label: PLASA E1.33, Remote Device Management (RDM) controller status notifications
notation: rdmnet-ctrl
term status: stable
date: 2012-06-01
description: PLASA E1.33, Remote Device Management (RDM) controller status notifications
ports: 5569 (TCP)
in dataset: service

Simon Newton
type: Agent

5569 (TCP)
type: Port
notation: 5569

TCP
type: Concept
type: Thing
type: NamedIndividual
type: Protocol
label: Transmission Control
notation: tcp
term status: stable
description: Transmission Control
IANA ref: RFC9293
in dataset: protocol
has part: 5569 (TCP)

RFC9293
type: Document

rdmnet-ctrl
type: Document
primary topic: RDMNET-CTRL