SUPPORTASSIST
type: Concept
type: Thing
type: NamedIndividual
type: Service
label: Dell SupportAssist data center management
notation: supportassist
term status: stable
date: 2016-07-05
description: Dell SupportAssist data center management
ports: 5700 (TCP)
in dataset: service

Rohitdev Kulshrestha
type: Agent

5700 (TCP)
type: Port
notation: 5700

TCP
type: Concept
type: Thing
type: NamedIndividual
type: Protocol
label: Transmission Control
notation: tcp
term status: stable
description: Transmission Control
IANA ref: RFC9293
in dataset: protocol
has part: 5700 (TCP)

RFC9293
type: Document

supportassist
type: Document
primary topic: SUPPORTASSIST