XCAP-CONTROL
type: Concept
type: Thing
type: NamedIndividual
type: Service
label: xcap code analysis portal cluster control and administration
notation: xcap-control
term status: stable
date: 2018-06-06
description: xcap code analysis portal cluster control and administration
ports: 4889 (TCP)
in dataset: service

Manfred Koethe
type: Agent

4889 (TCP)
type: Port
notation: 4889

TCP
type: Concept
type: Thing
type: NamedIndividual
type: Protocol
label: Transmission Control
notation: tcp
term status: stable
description: Transmission Control
IANA ref: RFC9293
in dataset: protocol
has part: 4889 (TCP)

RFC9293
type: Document

xcap-control
type: Document
primary topic: XCAP-CONTROL