3EXMP
type: Concept
type: Thing
type: NamedIndividual
type: Service
label: 3eTI Extensible Management Protocol for OAMP
notation: 3exmp
term status: stable
date: 2010-05-19
description: 3eTI Extensible Management Protocol for OAMP
ports: 5221 (TCP)
in dataset: service

Bill Rettig
type: Agent

5221 (TCP)
type: Port
notation: 5221

TCP
type: Concept
type: Thing
type: NamedIndividual
type: Protocol
label: Transmission Control
notation: tcp
term status: stable
description: Transmission Control
IANA ref: RFC9293
in dataset: protocol
has part: 5221 (TCP)

RFC9293
type: Document

3exmp
type: Document
primary topic: 3EXMP