ADCP
type: Concept
type: Thing
type: NamedIndividual
type: Service
label: Automation Device Configuration Protocol
notation: adcp
term status: stable
date: 2011-05-27
modified: 2012-07-26
description: Automation Device Configuration Protocol
ports: 7508 (TCP)
in dataset: service

Joerg Ullmann
type: Agent

7508 (TCP)
type: Port
notation: 7508

TCP
type: Concept
type: Thing
type: NamedIndividual
type: Protocol
label: Transmission Control
notation: tcp
term status: stable
description: Transmission Control
IANA ref: RFC9293
in dataset: protocol
has part: 7508 (TCP)

RFC9293
type: Document

adcp
type: Document
primary topic: ADCP