ADDRESSBOOKSRV
type: Concept
type: Thing
type: NamedIndividual
type: Service
label: Address Book Server used for contacts and calendar synchronisation
notation: addressbooksrv
term status: stable
date: 2011-10-14
description: Address Book Server used for contacts and calendar synchronisation
in dataset: service

Alexander Hartner
type: Agent

TCP
type: Concept
type: Thing
type: NamedIndividual
type: Protocol
label: Transmission Control
notation: tcp
term status: stable
description: Transmission Control
IANA ref: RFC9293
in dataset: protocol
has part: ADDRESSBOOKSRV

RFC9293
type: Document

addressbooksrv
type: Document
primary topic: ADDRESSBOOKSRV