ALAZARTECH-ATN
type: Concept
type: Thing
type: NamedIndividual
type: Service
label: Alazar Technologies ATN Communication Protocol
notation: alazartech-atn
term status: stable
date: 2016-05-26
description: Alazar Technologies ATN Communication Protocol
in dataset: service

Romain Deterre
type: Agent

TCP
type: Concept
type: Thing
type: NamedIndividual
type: Protocol
label: Transmission Control
notation: tcp
term status: stable
description: Transmission Control
IANA ref: RFC9293
in dataset: protocol
has part: ALAZARTECH-ATN

RFC9293
type: Document

alazartech-atn
type: Document
primary topic: ALAZARTECH-ATN