AXON-TUNNEL
type: Concept
type: Thing
type: NamedIndividual
type: Service
label: Reliable multipath data transport for high latencies
notation: axon-tunnel
term status: stable
date: 2014-09-26
description: Reliable multipath data transport for high latencies
ports: 16665 (TCP)
in dataset: service

Paul Burgess
type: Agent

16665 (TCP)
type: Port
notation: 16665

TCP
type: Concept
type: Thing
type: NamedIndividual
type: Protocol
label: Transmission Control
notation: tcp
term status: stable
description: Transmission Control
IANA ref: RFC9293
in dataset: protocol
has part: 16665 (TCP)

RFC9293
type: Document

axon-tunnel
type: Document
primary topic: AXON-TUNNEL