BARROOMCOMEDY
type: Concept
type: Thing
type: NamedIndividual
type: Service
label: Peer to peer file sharing for a media player application
notation: barroomcomedy
term status: stable
date: 2013-11-05
description: Peer to peer file sharing for a media player application
in dataset: service

Fred Zimmerman
type: Agent

TCP
type: Concept
type: Thing
type: NamedIndividual
type: Protocol
label: Transmission Control
notation: tcp
term status: stable
description: Transmission Control
IANA ref: RFC9293
in dataset: protocol
has part: BARROOMCOMEDY

RFC9293
type: Document

barroomcomedy
type: Document
primary topic: BARROOMCOMEDY