BEATSDIRECT
type: Concept
type: Thing
type: NamedIndividual
type: Service
label: Beats Direct allows for the discovery and control of devices
notation: beatsdirect
term status: stable
date: 2013-06-03
description: Beats Direct allows for the discovery and control of devices
in dataset: service

Eddie Borjas
type: Agent

TCP
type: Concept
type: Thing
type: NamedIndividual
type: Protocol
label: Transmission Control
notation: tcp
term status: stable
description: Transmission Control
IANA ref: RFC9293
in dataset: protocol
has part: BEATSDIRECT

RFC9293
type: Document

beatsdirect
type: Document
primary topic: BEATSDIRECT